[SM-Grimoire-Bugs] [Bug 16119] New: gcc fails on bootstrap builds

bugzilla-daemon at bugs.sourcemage.org bugzilla-daemon at bugs.sourcemage.org
Mon May 27 19:55:45 EDT 2019


            Bug ID: 16119
           Summary: gcc fails on bootstrap builds
           Product: Codex
           Version: test grimoire
          Hardware: x86-64
                OS: Linux
            Status: NEW
          Severity: normal
          Priority: P2
         Component: gnu
          Assignee: sm-grimoire-bugs at lists.ibiblio.org
          Reporter: ismael at iodev.co.uk
    Classification: Unclassified

Created attachment 7625
  --> https://bugs.sourcemage.org/attachment.cgi?id=7625&action=edit
GCC compile log

/usr/src/gcc-9.1.0.bld/./gcc/xgcc -B/usr/src/gcc-9.1.0.bld/./gcc/
-B/usr/x86_64-pc-linux-musl/bin/ -B/usr/x86_64-pc-linux-musl/lib/ -isystem
/usr/x86_64-pc-linux-musl/include -isystem
/usr/x86_64-pc-linux-musl/sys-include   -fno-checking -O2  -g -O2 -O1
-march=native -mtune=native -m64  -DPIC -fPIC -ffast-math -funroll-loops -Os
-DIN_GCC    -W -Wall -Wno-narrowing -Wwrite-strings -Wcast-qual -Wno-format
-Wstrict-prototypes -Wmissing-prototypes -Wold-style-definition  -isystem
./include   -fPIC -mlong-double-80 -DUSE_ELF_SYMVER -fcf-protection -mshstk -g
-DIN_LIBGCC2 -fbuilding-libgcc -fno-stack-protector  -shared -nodefaultlibs
-Wl,--soname=libgcc_s.so.1 -Wl,--version-script=libgcc.map -o
32/libgcc_s.so.1.tmp -g -O2 -O1 -march=native -mtune=native -m64 -DPIC -fPIC
-ffast-math -funroll-loops -Os -m32 -B./ _muldi3_s.o _negdi2_s.o _lshrdi3_s.o
_ashldi3_s.o _ashrdi3_s.o _cmpdi2_s.o _ucmpdi2_s.o _clear_cache_s.o
_trampoline_s.o __main_s.o _absvsi2_s.o _absvdi2_s.o _addvsi3_s.o _addvdi3_s.o
_subvsi3_s.o _subvdi3_s.o _mulvsi3_s.o _mulvdi3_s.o _negvsi2_s.o _negvdi2_s.o
_ctors_s.o _ffssi2_s.o _ffsdi2_s.o _clz_s.o _clzsi2_s.o _clzdi2_s.o _ctzsi2_s.o
_ctzdi2_s.o _popcount_tab_s.o _popcountsi2_s.o _popcountdi2_s.o _paritysi2_s.o
_paritydi2_s.o _powisf2_s.o _powidf2_s.o _powixf2_s.o _powitf2_s.o _mulhc3_s.o
_mulsc3_s.o _muldc3_s.o _mulxc3_s.o _multc3_s.o _divhc3_s.o _divsc3_s.o
_divdc3_s.o _divxc3_s.o _divtc3_s.o _bswapsi2_s.o _bswapdi2_s.o _clrsbsi2_s.o
_clrsbdi2_s.o _fixunssfsi_s.o _fixunsdfsi_s.o _fixunsxfsi_s.o _fixsfdi_s.o
_fixdfdi_s.o _fixxfdi_s.o _fixunssfdi_s.o _fixunsdfdi_s.o _fixunsxfdi_s.o
_floatdisf_s.o _floatdidf_s.o _floatdixf_s.o _floatundisf_s.o _floatundidf_s.o
_floatundixf_s.o _divdi3_s.o _moddi3_s.o _divmoddi4_s.o _udivdi3_s.o
_umoddi3_s.o _udivmoddi4_s.o _udiv_w_sdiv_s.o tf-signs_s.o sfp-exceptions_s.o
addtf3_s.o divtf3_s.o eqtf2_s.o getf2_s.o letf2_s.o multf3_s.o negtf2_s.o
subtf3_s.o unordtf2_s.o fixtfsi_s.o fixunstfsi_s.o floatsitf_s.o
floatunsitf_s.o fixtfdi_s.o fixunstfdi_s.o floatditf_s.o floatunditf_s.o
extendsftf2_s.o extenddftf2_s.o extendxftf2_s.o trunctfsf2_s.o trunctfdf2_s.o
trunctfxf2_s.o enable-execute-stack_s.o unwind-dw2_s.o unwind-dw2-fde-dip_s.o
unwind-sjlj_s.o unwind-c_s.o emutls_s.o libgcc.a -lc && rm -f 32/libgcc_s.so &&
if [ -f 32/libgcc_s.so.1 ]; then mv -f 32/libgcc_s.so.1
32/libgcc_s.so.1.backup; else true; fi && mv 32/libgcc_s.so.1.tmp
32/libgcc_s.so.1 && (echo "/* GNU ld script"; echo "   Use the shared library,
but some functions are only in"; echo "   the static library.  */"; echo "GROUP
( libgcc_s.so.1 -lgcc )" ) > 32/libgcc_s.so
/usr/bin/ld: skipping incompatible /lib/../lib/libc.so when searching for -lc
/usr/bin/ld: skipping incompatible /lib/../lib/libc.a when searching for -lc
/usr/bin/ld: skipping incompatible /lib/libc.so when searching for -lc
/usr/bin/ld: skipping incompatible /lib/libc.a when searching for -lc
/usr/bin/ld: cannot find -lc
collect2: error: ld returned 1 exit status
make[5]: *** [Makefile:992: libgcc_s.so] Error 1
make[5]: Leaving directory
make[4]: *** [Makefile:1210: multi-do] Error 1
make[4]: Leaving directory '/usr/src/gcc-9.1.0.bld/x86_64-pc-linux-musl/libgcc'
make[3]: *** [Makefile:127: all-multi] Error 2
make[3]: Leaving directory '/usr/src/gcc-9.1.0.bld/x86_64-pc-linux-musl/libgcc'
make[2]: *** [Makefile:16609: all-stage1-target-libgcc] Error 2
make[2]: Leaving directory '/usr/src/gcc-9.1.0.bld'
make[1]: *** [Makefile:22245: stage1-bubble] Error 2
make[1]: Leaving directory '/usr/src/gcc-9.1.0.bld'
make: *** [Makefile:22561: bootstrap-lean] Error 2
 ! Problem Detected !

You are receiving this mail because:
You are the assignee for the bug.
-------------- next part --------------
An HTML attachment was scrubbed...
URL: <http://lists.ibiblio.org/pipermail/sm-grimoire-bugs/attachments/20190527/3270e37c/attachment.html>

More information about the SM-Grimoire-Bugs mailing list