[SM-Grimoire-Bugs] [Bug 16115] New: tcc 0.9.27 fails to build against musl

bugzilla-daemon at bugs.sourcemage.org bugzilla-daemon at bugs.sourcemage.org
Thu May 23 05:32:13 EDT 2019


https://bugs.sourcemage.org/show_bug.cgi?id=16115

            Bug ID: 16115
           Summary: tcc 0.9.27 fails to build against musl
           Product: Codex
           Version: test grimoire
          Hardware: x86
                OS: Linux
            Status: NEW
          Severity: normal
          Priority: P2
         Component: devel
          Assignee: sm-grimoire-bugs at lists.ibiblio.org
          Reporter: ismael at iodev.co.uk
    Classification: Unclassified

[...]
make[1]: Entering directory '/usr/src/tcc-0.9.27/lib'
../tcc -c libtcc1.c -o libtcc1.o -B..
../tcc -c alloca86_64.S -o alloca86_64.o -B..
../tcc -c alloca86_64-bt.S -o alloca86_64-bt.o -B..
../tcc -c va_list.c -o va_list.o -B..
../tcc -c bcheck.c -o bcheck.o -B..
In file included from bcheck.c:21:
In file included from /usr/include/stdio.h:26:
/usr/include/bits/alltypes.h:6: error: ';' expected (got "va_list")
make[1]: *** [Makefile:64: bcheck.o] Error 1
make[1]: Leaving directory '/usr/src/tcc-0.9.27/lib'
make: *** [Makefile:230: libtcc1.a] Error 2
Running make with 8 jobs failed. Attempt to run with a single job? [y]

make[1]: Entering directory '/usr/src/tcc-0.9.27/lib'
../tcc -c bcheck.c -o bcheck.o -B..
In file included from bcheck.c:21:
In file included from /usr/include/stdio.h:26:
/usr/include/bits/alltypes.h:6: error: ';' expected (got "va_list")
make[1]: *** [Makefile:64: bcheck.o] Error 1
make[1]: Leaving directory '/usr/src/tcc-0.9.27/lib'
make: *** [Makefile:230: libtcc1.a] Error 2
 ! Problem Detected !

-- 
You are receiving this mail because:
You are the assignee for the bug.
-------------- next part --------------
An HTML attachment was scrubbed...
URL: <http://lists.ibiblio.org/pipermail/sm-grimoire-bugs/attachments/20190523/48aff63b/attachment-0001.html>


More information about the SM-Grimoire-Bugs mailing list