[SM-Grimoire-Bugs] [Bug 15574] New: polkit-qt-1 fails to compile

bugzilla-daemon at bugs.sourcemage.org bugzilla-daemon at bugs.sourcemage.org
Thu Feb 11 04:33:20 EST 2010


http://bugs.sourcemage.org/show_bug.cgi?id=15574

           Summary: polkit-qt-1 fails to compile
           Product: Codex
           Version: test grimoire
          Platform: x86
        OS/Version: Linux
            Status: NEW
          Severity: normal
          Priority: P3
         Component: kde4
        AssignedTo: sm-grimoire-bugs at lists.ibiblio.org
        ReportedBy: pyrobor at ver.si


For me polkit-qt-1 fails to compile. I have policykit version 0.96 installed:
$ gv policykit polkit polkit-qt-1
Grimoire  Section       Spell        Grimoire Version  Installed Version
--------  -------       -----        ----------------  -----------------
test      gnome2-libs   policykit    0.96              0.96
test      kde4-support  polkit-qt-1  0.95.1            -

[ 75%] Building CXX object
agent/CMakeFiles/polkit-qt-agent-1.dir/polkitqt1-agent-session.cpp.o
/usr/src/polkit-qt-1-0.95.1/agent/polkitqt1-agent-session.cpp:28:37: error:
polkitagent/polkitagent.h: No such file or directory
/usr/src/polkit-qt-1-0.95.1/agent/polkitqt1-agent-session.cpp:38: error:
'gboolean' has not been declared
/usr/src/polkit-qt-1-0.95.1/agent/polkitqt1-agent-session.cpp:38: error:
'gpointer' has not been declared
/usr/src/polkit-qt-1-0.95.1/agent/polkitqt1-agent-session.cpp:39: error:
'gchar' has not been declared
/usr/src/polkit-qt-1-0.95.1/agent/polkitqt1-agent-session.cpp:39: error:
'gboolean' has not been declared
/usr/src/polkit-qt-1-0.95.1/agent/polkitqt1-agent-session.cpp:39: error:
'gpointer' has not been declared
/usr/src/polkit-qt-1-0.95.1/agent/polkitqt1-agent-session.cpp:40: error:
'gchar' has not been declared
/usr/src/polkit-qt-1-0.95.1/agent/polkitqt1-agent-session.cpp:40: error:
'gpointer' has not been declared
/usr/src/polkit-qt-1-0.95.1/agent/polkitqt1-agent-session.cpp:41: error:
'gchar' has not been declared
/usr/src/polkit-qt-1-0.95.1/agent/polkitqt1-agent-session.cpp:41: error:
'gpointer' has not been declared
/usr/src/polkit-qt-1-0.95.1/agent/polkitqt1-agent-session.cpp: In destructor
'PolkitQt1::Agent::Session::Private::~Private()':
/usr/src/polkit-qt-1-0.95.1/agent/polkitqt1-agent-session.cpp:49: error:
'g_object_unref' was not declared in this scope
/usr/src/polkit-qt-1-0.95.1/agent/polkitqt1-agent-session.cpp: In constructor
'PolkitQt1::Agent::Session::Session(PolkitQt1::Identity*, cons
t QString&, PolkitQt1::Agent::AsyncResult*, QObject*)':
/usr/src/polkit-qt-1-0.95.1/agent/polkitqt1-agent-session.cpp:57: error:
'polkit_agent_session_new' was not declared in this scope
/usr/src/polkit-qt-1-0.95.1/agent/polkitqt1-agent-session.cpp:58: error:
'G_OBJECT' was not declared in this scope
/usr/src/polkit-qt-1-0.95.1/agent/polkitqt1-agent-session.cpp:58: error:
'G_CALLBACK' was not declared in this scope
/usr/src/polkit-qt-1-0.95.1/agent/polkitqt1-agent-session.cpp:58: error:
'g_signal_connect' was not declared in this scope
/usr/src/polkit-qt-1-0.95.1/agent/polkitqt1-agent-session.cpp: In constructor
'PolkitQt1::Agent::Session::Session(PolkitAgentSession*, QObje
ct*)':
/usr/src/polkit-qt-1-0.95.1/agent/polkitqt1-agent-session.cpp:69: error:
'G_OBJECT' was not declared in this scope
/usr/src/polkit-qt-1-0.95.1/agent/polkitqt1-agent-session.cpp:69: error:
'G_CALLBACK' was not declared in this scope
/usr/src/polkit-qt-1-0.95.1/agent/polkitqt1-agent-session.cpp:69: error:
'g_signal_connect' was not declared in this scope
/usr/src/polkit-qt-1-0.95.1/agent/polkitqt1-agent-session.cpp: In member
function 'void PolkitQt1::Agent::Session::initiate()':
/usr/src/polkit-qt-1-0.95.1/agent/polkitqt1-agent-session.cpp:82: error:
'polkit_agent_session_initiate' was not declared in this scope
/usr/src/polkit-qt-1-0.95.1/agent/polkitqt1-agent-session.cpp: In member
function 'void PolkitQt1::Agent::Session::setResponse(const QString&)':
/usr/src/polkit-qt-1-0.95.1/agent/polkitqt1-agent-session.cpp:87: error:
'polkit_agent_session_response' was not declared in this scope
/usr/src/polkit-qt-1-0.95.1/agent/polkitqt1-agent-session.cpp: In member
function 'void PolkitQt1::Agent::Session::cancel()':
/usr/src/polkit-qt-1-0.95.1/agent/polkitqt1-agent-session.cpp:92: error:
'polkit_agent_session_cancel' was not declared in this scope
/usr/src/polkit-qt-1-0.95.1/agent/polkitqt1-agent-session.cpp: At global scope:
/usr/src/polkit-qt-1-0.95.1/agent/polkitqt1-agent-session.cpp:100: error:
'gboolean' has not been declared
/usr/src/polkit-qt-1-0.95.1/agent/polkitqt1-agent-session.cpp:100: error:
'gpointer' has not been declared
/usr/src/polkit-qt-1-0.95.1/agent/polkitqt1-agent-session.cpp:107: error:
'gchar' has not been declared
/usr/src/polkit-qt-1-0.95.1/agent/polkitqt1-agent-session.cpp:107: error:
'gboolean' has not been declared
/usr/src/polkit-qt-1-0.95.1/agent/polkitqt1-agent-session.cpp:107: error:
'gpointer' has not been declared
/usr/src/polkit-qt-1-0.95.1/agent/polkitqt1-agent-session.cpp: In static member
function 'static void
PolkitQt1::Agent::Session::Private::request(PolkitAgentSession*, int*, int,
int)':
/usr/src/polkit-qt-1-0.95.1/agent/polkitqt1-agent-session.cpp:110: error: no
matching function for call to 'QString::fromUtf8(int*&)'
/usr/include/QtCore/qstring.h:325: note: candidates are: static QString
QString::fromUtf8(const char*, int)
/usr/src/polkit-qt-1-0.95.1/agent/polkitqt1-agent-session.cpp: At global scope:
/usr/src/polkit-qt-1-0.95.1/agent/polkitqt1-agent-session.cpp:113: error:
'gchar' has not been declared
/usr/src/polkit-qt-1-0.95.1/agent/polkitqt1-agent-session.cpp:113: error:
'gpointer' has not been declared
/usr/src/polkit-qt-1-0.95.1/agent/polkitqt1-agent-session.cpp: In static member
function 'static void
PolkitQt1::Agent::Session::Private::showError(PolkitAgentSession*, int*, int)':
/usr/src/polkit-qt-1-0.95.1/agent/polkitqt1-agent-session.cpp:116: error: no
matching function for call to 'QString::fromUtf8(int*&)'
/usr/include/QtCore/qstring.h:325: note: candidates are: static QString
QString::fromUtf8(const char*, int)
/usr/src/polkit-qt-1-0.95.1/agent/polkitqt1-agent-session.cpp: At global scope:
/usr/src/polkit-qt-1-0.95.1/agent/polkitqt1-agent-session.cpp:119: error:
'gchar' has not been declared
/usr/src/polkit-qt-1-0.95.1/agent/polkitqt1-agent-session.cpp:119: error:
'gpointer' has not been declared
/usr/src/polkit-qt-1-0.95.1/agent/polkitqt1-agent-session.cpp: In static member
function 'static void
PolkitQt1::Agent::Session::Private::showInfo(PolkitAgentSession*, int*, int)':
/usr/src/polkit-qt-1-0.95.1/agent/polkitqt1-agent-session.cpp:122: error: no
matching function for call to 'QString::fromUtf8(int*&)'
/usr/include/QtCore/qstring.h:325: note: candidates are: static QString
QString::fromUtf8(const char*, int)
/usr/src/polkit-qt-1-0.95.1/agent/polkitqt1-agent-session.cpp: In destructor
'virtual PolkitQt1::Agent::AsyncResult::~AsyncResult()':
/usr/src/polkit-qt-1-0.95.1/agent/polkitqt1-agent-session.cpp:142: error:
'g_object_unref' was not declared in this scope
/usr/src/polkit-qt-1-0.95.1/agent/polkitqt1-agent-session.cpp: In member
function 'void PolkitQt1::Agent::AsyncResult::setCompleted()':
/usr/src/polkit-qt-1-0.95.1/agent/polkitqt1-agent-session.cpp:149: error:
'g_simple_async_result_complete' was not declared in this scope
/usr/src/polkit-qt-1-0.95.1/agent/polkitqt1-agent-session.cpp:151: error:
'g_object_unref' was not declared in this scope
/usr/src/polkit-qt-1-0.95.1/agent/polkitqt1-agent-session.cpp: In member
function 'void PolkitQt1::Agent::AsyncResult::setError(const QString&)':
/usr/src/polkit-qt-1-0.95.1/agent/polkitqt1-agent-session.cpp:158: error:
'POLKIT_ERROR' was not declared in this scope
/usr/src/polkit-qt-1-0.95.1/agent/polkitqt1-agent-session.cpp:158: error:
'POLKIT_ERROR_FAILED' was not declared in this scope
/usr/src/polkit-qt-1-0.95.1/agent/polkitqt1-agent-session.cpp:158: error:
'g_simple_async_result_set_error' was not declared in this scope
make[2]: ***
[agent/CMakeFiles/polkit-qt-agent-1.dir/polkitqt1-agent-session.cpp.o] Error 1
make[1]: *** [agent/CMakeFiles/polkit-qt-agent-1.dir/all] Error 2
make: *** [all] Error 2
ESC[31mESC[1m ! Problem Detected ! ESC[0m

-- 
Configure bugmail: http://bugs.sourcemage.org/userprefs.cgi?tab=email
------- You are receiving this mail because: -------
You are the assignee for the bug.



More information about the SM-Grimoire-Bugs mailing list