[SM-Grimoire-Bugs] [Bug 15498] New: libvirt cannot find devicekit gobject

bugzilla-daemon at bugs.sourcemage.org bugzilla-daemon at bugs.sourcemage.org
Sat Nov 21 13:57:25 EST 2009


http://bugs.sourcemage.org/show_bug.cgi?id=15498

           Summary: libvirt cannot find devicekit gobject
           Product: Codex
           Version: test grimoire
          Platform: All
        OS/Version: Linux
            Status: NEW
          Severity: normal
          Priority: P3
         Component: libs
        AssignedTo: sm-grimoire-bugs at lists.ibiblio.org
        ReportedBy: sandalle at sourcemage.org


$ sorcery -v
1.14.4

$ gaze version lvm devicekit libvirt
Grimoire  Section      Spell      Grimoire Version  Installed Version
--------  -------      -----      ----------------  -----------------
test      disk         lvm        2.02.54           2.02.54
test      gnome2-libs  devicekit  003               003
test      libs         libvirt    0.7.2             0.4.6

# cast libvirt
Computing previously installed dependencies...
libvirt preparing environment...
libvirt running configuration...
[[ Build mpath storage backend -> y ]]
[[ Build FileSystem storage backend -> y ]]
[[ Build virtual network driver -> y ]]
[[ Build with QEMU/KVM support -> y ]]
[[ Build with VMWare ESX/GSX support -> y ]]
[[ Build Linux Containers(lxc) support -> y ]]
[[ Build VirtualBox support -> y ]]
[[ Build User Mode Linux support -> y ]]
[[ Build remote driver support? -> y ]]
[[ Build libvirtd support? -> y ]]
Install init script libvirtd? [y]
Enable init script libvirtd? [n]
libvirt checking dependencies...
libvirt has a dependency on gnutls
libvirt has a dependency on libxml2
libvirt has a dependency on readline
libvirt has a dependency on curl
libvirt has a dependency on glib2
libvirt has a dependency on gnutls
libvirt has a dependency on lvm
libvirt has a disabled optional dependency on avahi
libvirt has an optional dependency on some LIBSASL (for Cyrus SASL
authentication support).
Continue to use libsasl? [y]
libvirt has an enabled optional dependency on gettext
libvirt has an enabled optional dependency on iptables
libvirt has an optional dependency on xen-tools (for Xen support)
Do you want to cast xen-tools? [n]
libvirt has an enabled optional dependency on parted
libvirt has an optional dependency on hal (HAL support)
Do you want to use hal? [y]
libvirt has an optional dependency on devicekit (DeviceKit support)
Do you want to use devicekit? [y]
libvirt has an enabled optional dependency on python
libvirt has an optional dependency on policykit (PolicyKit support)
Do you want to use policykit? [y]
libvirt has an optional dependency on libssh2 (SSH2 support)
Do you want to use libssh2? [y]
Python bindings requested, forcing python dependency
libvirt has a dependency on python
...
  CCLD   libvirt_driver_storage.la
  CC     libvirt_driver_nodedev_la-node_device_devkit.lo
node_device/node_device_devkit.c:25:28: error: devkit-gobject.h: No such file
or directory
node_device/node_device_devkit.c:36:25: error: node_device.h: No such file or
directory
node_device/node_device_devkit.c:51: error: expected ')' before '*' token
node_device/node_device_devkit.c:87: error: expected ')' before '*' token
node_device/node_device_devkit.c:105: error: expected ')' before '*' token
node_device/node_device_devkit.c:114: error: expected ')' before '*' token
node_device/node_device_devkit.c:134: error: expected ')' before '*' token
node_device/node_device_devkit.c:149: error: expected ')' before '*' token
node_device/node_device_devkit.c:151: warning: no semicolon at end of struct or
union
node_device/node_device_devkit.c:156: error: 'gather_pci_cap' undeclared here
(not in a function)
node_device/node_device_devkit.c:156: warning: excess elements in struct
initializer
node_device/node_device_devkit.c:156: warning: (near initialization for
'caps_tbl[0]')
node_device/node_device_devkit.c:157: error: 'gather_usb_cap' undeclared here
(not in a function)
node_device/node_device_devkit.c:157: warning: excess elements in struct
initializer
node_device/node_device_devkit.c:157: warning: (near initialization for
'caps_tbl[1]')
node_device/node_device_devkit.c:158: error: 'gather_net_cap' undeclared here
(not in a function)
node_device/node_device_devkit.c:158: warning: excess elements in struct
initializer
node_device/node_device_devkit.c:158: warning: (near initialization for
'caps_tbl[2]')
node_device/node_device_devkit.c:159: error: 'gather_storage_cap' undeclared
here (not in a function)
node_device/node_device_devkit.c:159: warning: excess elements in struct
initializer
node_device/node_device_devkit.c:159: warning: (near initialization for
'caps_tbl[3]')
node_device/node_device_devkit.c:172: error: expected ')' before '*' token
node_device/node_device_devkit.c:202: error: expected ')' before '*' token
node_device/node_device_devkit.c: In function 'dev_create':
node_device/node_device_devkit.c:234: error: 'DevkitDevice' undeclared (first
use in this function)
node_device/node_device_devkit.c:234: error: (Each undeclared identifier is
reported only once
node_device/node_device_devkit.c:234: error: for each function it appears in.)
node_device/node_device_devkit.c:234: error: 'dkdev' undeclared (first use in
this function)
node_device/node_device_devkit.c:235: warning: implicit declaration of function
'devkit_device_get_native_path'
node_device/node_device_devkit.c:235: warning: nested extern declaration of
'devkit_device_get_native_path'
node_device/node_device_devkit.c:235: warning: initialization makes pointer
from integer without a cast
node_device/node_device_devkit.c:259: warning: implicit declaration of function
'gather_capabilities'
node_device/node_device_devkit.c:259: warning: nested extern declaration of
'gather_capabilities'
node_device/node_device_devkit.c:262: warning: implicit declaration of function
'nodeDeviceLock'
node_device/node_device_devkit.c:262: warning: nested extern declaration of
'nodeDeviceLock'
node_device/node_device_devkit.c:268: warning: implicit declaration of function
'nodeDeviceUnlock'
node_device/node_device_devkit.c:268: warning: nested extern declaration of
'nodeDeviceUnlock'
node_device/node_device_devkit.c: In function 'devkitDeviceMonitorStartup':
node_device/node_device_devkit.c:290: error: 'DevkitClient' undeclared (first
use in this function)
node_device/node_device_devkit.c:290: error: 'devkit_client' undeclared (first
use in this function)
node_device/node_device_devkit.c:291: error: 'GError' undeclared (first use in
this function)
node_device/node_device_devkit.c:291: error: 'err' undeclared (first use in
this function)
node_device/node_device_devkit.c:292: error: 'GList' undeclared (first use in
this function)
node_device/node_device_devkit.c:292: error: 'devs' undeclared (first use in
this function)
node_device/node_device_devkit.c:306: warning: implicit declaration of function
'g_type_init'
node_device/node_device_devkit.c:306: warning: nested extern declaration of
'g_type_init'
node_device/node_device_devkit.c:309: warning: implicit declaration of function
'devkit_client_new'
node_device/node_device_devkit.c:309: warning: nested extern declaration of
'devkit_client_new'
node_device/node_device_devkit.c:314: warning: implicit declaration of function
'devkit_client_connect'
node_device/node_device_devkit.c:314: warning: nested extern declaration of
'devkit_client_connect'
node_device/node_device_devkit.c:336: warning: implicit declaration of function
'devkit_client_enumerate_by_subsystem'
node_device/node_device_devkit.c:336: warning: nested extern declaration of
'devkit_client_enumerate_by_subsystem'
node_device/node_device_devkit.c:344: warning: implicit declaration of function
'g_list_foreach'
node_device/node_device_devkit.c:344: warning: nested extern declaration of
'g_list_foreach'
node_device/node_device_devkit.c:357: warning: implicit declaration of function
'g_error_free'
node_device/node_device_devkit.c:357: warning: nested extern declaration of
'g_error_free'
node_device/node_device_devkit.c:360: error: 'GFunc' undeclared (first use in
this function)
node_device/node_device_devkit.c:360: error: expected ')' before
'g_object_unref'
node_device/node_device_devkit.c:361: warning: implicit declaration of function
'g_list_free'
node_device/node_device_devkit.c:361: warning: nested extern declaration of
'g_list_free'
node_device/node_device_devkit.c:364: warning: implicit declaration of function
'g_object_unref'
node_device/node_device_devkit.c:364: warning: nested extern declaration of
'g_object_unref'
node_device/node_device_devkit.c: In function 'devkitDeviceMonitorShutdown':
node_device/node_device_devkit.c:374: error: 'DevkitClient' undeclared (first
use in this function)
node_device/node_device_devkit.c:374: error: 'devkit_client' undeclared (first
use in this function)
node_device/node_device_devkit.c:377: error: expected expression before ')'
token
node_device/node_device_devkit.c:382: error: 'driveState' undeclared (first use
in this function)
node_device/node_device_devkit.c: In function 'devkitDeviceMonitorReload':
node_device/node_device_devkit.c:395: error: too few arguments to function
'devkitDeviceMonitorStartup'
node_device/node_device_devkit.c: At top level:
node_device/node_device_devkit.c:440: warning: no previous prototype for
'devkitNodeRegister'
node_device/node_device_devkit.c: In function 'devkitNodeRegister':
node_device/node_device_devkit.c:442: warning: implicit declaration of function
'registerCommonNodeFuncs'
node_device/node_device_devkit.c:442: warning: nested extern declaration of
'registerCommonNodeFuncs'
make[3]: *** [libvirt_driver_nodedev_la-node_device_devkit.lo] Error 1
make[3]: Leaving directory `/usr/src/libvirt-0.7.2/src'
make[2]: Leaving directory `/usr/src/libvirt-0.7.2/src'
make[2]: *** [all] Error 2
make[1]: Leaving directory `/usr/src/libvirt-0.7.2'
make[1]: *** [all-recursive] Error 1
make: *** [all] Error 2

-- 
Configure bugmail: http://bugs.sourcemage.org/userprefs.cgi?tab=email
------- You are receiving this mail because: -------
You are the assignee for the bug.



More information about the SM-Grimoire-Bugs mailing list