[SM-Grimoire-Bugs] [Bug 15494] New: kdesdk4 4.3.3 fails to subversion ioslave

bugzilla-daemon at bugs.sourcemage.org bugzilla-daemon at bugs.sourcemage.org
Sun Nov 15 14:02:05 EST 2009


http://bugs.sourcemage.org/show_bug.cgi?id=15494

           Summary: kdesdk4 4.3.3 fails to subversion ioslave
           Product: Codex
           Version: test grimoire
          Platform: All
        OS/Version: Linux
            Status: NEW
          Severity: normal
          Priority: P3
         Component: kde4
        AssignedTo: sm-grimoire-bugs at lists.ibiblio.org
        ReportedBy: sandalle at sourcemage.org


$ sorcery -v
1.14.4

kdesdk4 4.3.2 built fine before:
$ gaze version kdesdk4
Grimoire  Section  Spell    Grimoire Version  Installed Version
--------  -------  -----    ----------------  -----------------
test      kde4     kdesdk4  4.3.3             4.3.2

$ gaze version kdepimlibs4 kdebase-workspace4 apr-util subversion db
Grimoire  Section   Spell               Grimoire Version  Installed Version
--------  -------   -----               ----------------  -----------------
test      kde4      kdepimlibs4         4.3.3             4.3.3
test      kde4      kdebase-workspace4  4.3.3             4.3.3
test      libs      apr-util            1.3.9             1.3.9
test      collab    subversion          1.6.6             1.6.6
test      database  db                  4.8.24            4.8.24

# cast kdesdk4
Computing previously installed dependencies...
kdesdk4 preparing environment...
kdesdk4 running configuration...
[[ Enable debug code? -> n ]]
[[ Build Subversion SCM support? -> y ]]
kdesdk4 checking dependencies...
kdesdk4 has a dependency on g++
kdesdk4 has a dependency on cmake
kdesdk4 has a dependency on kdebase4-runtime
kdesdk4 has an enabled optional dependency on kdebase-workspace4
kdesdk4 has a dependency on kdepimlibs4
kdesdk4 has a dependency on some APU.
Continue to use apr-util? [y] y
kdesdk4 has a dependency on subversion
kdesdk4 has an enabled optional dependency on db
g++ No work to do.
cmake No work to do.
kdebase4-runtime No work to do.
kdebase-workspace4 No work to do.
kdepimlibs4 No work to do.
apr-util No work to do.
subversion No work to do.
db No work to do.
Collating dependencies...
Spells are to be cast:
---------------------------
kdesdk4

Do you want to cast these spells? [y] y
...
[ 47%] Generating ksvndadaptor.moc
Scanning dependencies of target kded_ksvnd
[ 47%] Building CXX object
kioslave/svn/ksvnd/CMakeFiles/kded_ksvnd.dir/kded_ksvnd_automoc.o
[ 47%] Building CXX object kioslave/svn/ksvnd/CMakeFiles/kded_ksvnd.dir/ksvnd.o
[ 47%] /usr/src/kdesdk-4.3.3/kioslave/svn/ksvnd/ksvnd.cpp: In member function
'QStringList KSvnd::getTopLevelActionMenu(const QStringList&)':
/usr/src/kdesdk-4.3.3/kioslave/svn/ksvnd/ksvnd.cpp:347: warning: suggest
parentheses around && within ||
Building CXX object kioslave/svn/ksvnd/CMakeFiles/kded_ksvnd.dir/ksvndadaptor.o
make[2]: *** [kioslave/svn/CMakeFiles/kio_svn.dir/svn.o] Error 1
make[1]: *** [kioslave/svn/CMakeFiles/kio_svn.dir/all] Error 2
make[1]: *** Waiting for unfinished jobs....
Linking CXX shared module ../../../lib/kded_ksvnd.so
[ 47%] Built target kded_ksvnd
make: *** [all] Error 2

-- 
Configure bugmail: http://bugs.sourcemage.org/userprefs.cgi?tab=email
------- You are receiving this mail because: -------
You are the assignee for the bug.



More information about the SM-Grimoire-Bugs mailing list