[SM-Grimoire-Bugs] [Bug 15505] New: inkscape 0.47 fails to compile

bugzilla-daemon at bugs.sourcemage.org bugzilla-daemon at bugs.sourcemage.org
Wed Dec 2 03:50:17 EST 2009


http://bugs.sourcemage.org/show_bug.cgi?id=15505

           Summary: inkscape 0.47 fails to compile
           Product: Codex
           Version: test grimoire
          Platform: x86
        OS/Version: Linux
            Status: NEW
          Severity: normal
          Priority: P3
         Component: graphics
        AssignedTo: sm-grimoire-bugs at lists.ibiblio.org
        ReportedBy: pyrobor at ver.si


Created an attachment (id=7415)
 --> (http://bugs.sourcemage.org/attachment.cgi?id=7415)
full compile log of failure

ESC[34mESC[1mRunning make with 5 jobs failed. Attempt to run with a single job?
[y] ESC[0mmake: *** [all] Error 2

/usr/bin/make  all-recursive
make[1]: Entering directory `/usr/src/inkscape-0.47'
Making all in src
make[2]: Entering directory `/usr/src/inkscape-0.47/src'
depbase=`echo extension/internal/pdfinput/pdf-parser.o | sed
's|[^/]*$|.deps/&|;s|\.o$||'`;\
        g++ -DHAVE_CONFIG_H -I. -I.. -I/usr/lib/perl5/5.10.1/x86_64-linux/CORE 
 -I/usr/include/freetype2        -I/usr/includ
e/poppler   -I/usr/include/poppler/glib -I/usr/include/poppler
-I/usr/include/gtk-2.0 -I/usr/lib/gtk-2.0/include -I/usr/includ
e/cairo -I/usr/include/glib-2.0 -I/usr/lib/glib-2.0/include
-I/usr/include/pango-1.0 -I/usr/include/pixman-1 -I/usr/include/fr
eetype2 -I/usr/include/libpng12   -DPOTRACE=\"potrace\" -pthread
-I/usr/include/gdkmm-2.4 -I/usr/lib/gdkmm-2.4/include -I/usr/
include/giomm-2.4 -I/usr/lib/giomm-2.4/include -I/usr/include/pangomm-1.4
-I/usr/lib/pangomm-1.4/include -I/usr/include/gtk-2.
0 -I/usr/include/glibmm-2.4 -I/usr/lib/glibmm-2.4/include
-I/usr/include/glib-2.0 -I/usr/lib/glib-2.0/include -I/usr/include/s
igc++-2.0 -I/usr/lib/sigc++-2.0/include -I/usr/include/cairomm-1.0
-I/usr/include/pango-1.0 -I/usr/include/cairo -I/usr/includ
e/pixman-1 -I/usr/include/freetype2 -I/usr/include/libpng12
-I/usr/lib/gtk-2.0/include -I/usr/include/atk-1.0 -I/usr/include/g
tkmm-2.4 -I/usr/lib/gtkmm-2.4/include -I/usr/include/gtk-unix-print-2.0
-I/usr/include/atkmm-1.6 -I/usr/include/libxml2 -I/usr
/include/gtkspell-2.0   -I../cxxtest  -I./bind/javainc -I./bind/javainc/linux  
-Werror=format-security -Wall -Wformat -Wforma
t-security -W -D_FORTIFY_SOURCE=2   -Wpointer-arith -Wcast-align -Wsign-compare
-Woverloaded-virtual -Wswitch -Wno-unused-para
meter -march=core2 -fPIC -DPIC -pipe -Os -fopenmp -MT
extension/internal/pdfinput/pdf-parser.o -MD -MP -MF $depbase.Tpo -c -o
extension/internal/pdfinput/pdf-parser.o
extension/internal/pdfinput/pdf-parser.cpp &&\
        mv -f $depbase.Tpo $depbase.Po
extension/internal/pdfinput/pdf-parser.cpp: In member function 'void
PdfParser::opSetExtGState(Object*, int)':
extension/internal/pdfinput/pdf-parser.cpp:812: error: no matching function for
call to 'GfxColorSpace::parse(Object*)'
/usr/include/poppler/GfxState.h:182: note: candidates are: static
GfxColorSpace* GfxColorSpace::parse(Object*, Gfx*)
extension/internal/pdfinput/pdf-parser.cpp: In member function 'void
PdfParser::opSetFillColorSpace(Object*, int)':
extension/internal/pdfinput/pdf-parser.cpp:1012: error: no matching function
for call to 'GfxColorSpace::parse(Object*)'
/usr/include/poppler/GfxState.h:182: note: candidates are: static
GfxColorSpace* GfxColorSpace::parse(Object*, Gfx*)
extension/internal/pdfinput/pdf-parser.cpp:1014: error: no matching function
for call to 'GfxColorSpace::parse(Object*)'
/usr/include/poppler/GfxState.h:182: note: candidates are: static
GfxColorSpace* GfxColorSpace::parse(Object*, Gfx*)
extension/internal/pdfinput/pdf-parser.cpp: In member function 'void
PdfParser::opSetStrokeColorSpace(Object*, int)':
extension/internal/pdfinput/pdf-parser.cpp:1035: error: no matching function
for call to 'GfxColorSpace::parse(Object*)'
/usr/include/poppler/GfxState.h:182: note: candidates are: static
GfxColorSpace* GfxColorSpace::parse(Object*, Gfx*)
extension/internal/pdfinput/pdf-parser.cpp:1037: error: no matching function
for call to 'GfxColorSpace::parse(Object*)'
/usr/include/poppler/GfxState.h:182: note: candidates are: static
GfxColorSpace* GfxColorSpace::parse(Object*, Gfx*)
extension/internal/pdfinput/pdf-parser.cpp: In member function 'void
PdfParser::opSetFillColorN(Object*, int)':
extension/internal/pdfinput/pdf-parser.cpp:1104: error: no matching function
for call to 'GfxResources::lookupPattern(char*)'
/usr/include/poppler/Gfx.h:113: note: candidates are: GfxPattern*
GfxResources::lookupPattern(char*, Gfx*)
extension/internal/pdfinput/pdf-parser.cpp: In member function 'void
PdfParser::opSetStrokeColorN(Object*, int)':
extension/internal/pdfinput/pdf-parser.cpp:1148: error: no matching function
for call to 'GfxResources::lookupPattern(char*)'
/usr/include/poppler/Gfx.h:113: note: candidates are: GfxPattern*
GfxResources::lookupPattern(char*, Gfx*)
extension/internal/pdfinput/pdf-parser.cpp: In member function 'void
PdfParser::opShFill(Object*, int)':
extension/internal/pdfinput/pdf-parser.cpp:1546: error: no matching function
for call to 'GfxResources::lookupShading(char*)'
/usr/include/poppler/Gfx.h:114: note: candidates are: GfxShading*
GfxResources::lookupShading(char*, Gfx*)
extension/internal/pdfinput/pdf-parser.cpp: In member function 'void
PdfParser::doImage(Object*, Stream*, GBool)':
extension/internal/pdfinput/pdf-parser.cpp:2510: error: no matching function
for call to 'GfxColorSpace::parse(Object*)'
/usr/include/poppler/GfxState.h:182: note: candidates are: static
GfxColorSpace* GfxColorSpace::parse(Object*, Gfx*)
extension/internal/pdfinput/pdf-parser.cpp:2595: error: no matching function
for call to 'GfxColorSpace::parse(Object*)'
/usr/include/poppler/GfxState.h:182: note: candidates are: static
GfxColorSpace* GfxColorSpace::parse(Object*, Gfx*)
extension/internal/pdfinput/pdf-parser.cpp: In member function 'void
PdfParser::doForm(Object*)':
extension/internal/pdfinput/pdf-parser.cpp:2770: error: no matching function
for call to 'GfxColorSpace::parse(Object*)'
/usr/include/poppler/GfxState.h:182: note: candidates are: static
GfxColorSpace* GfxColorSpace::parse(Object*, Gfx*)
make[2]: Leaving directory `/usr/src/inkscape-0.47/src'
make[2]: *** [extension/internal/pdfinput/pdf-parser.o] Error 1
make[1]: *** [all-recursive] Error 1
make[1]: Leaving directory `/usr/src/inkscape-0.47'
make: *** [all] Error 2
ESC[31mESC[1m ! Problem Detected ! ESC[0m

bor at bik ~ 0 $ gv poppler poppler-data cairo
Grimoire  Section        Spell         Grimoire Version  Installed Version
--------  -------        -----         ----------------  -----------------
test      graphics-libs  poppler       0.12.2            0.12.2
test      graphics-libs  poppler-data  0.3.1             0.3.1
test      x11-libs       cairo         1.8.8             1.8.8

Have no clue what the problem is.

-- 
Configure bugmail: http://bugs.sourcemage.org/userprefs.cgi?tab=email
------- You are receiving this mail because: -------
You are the assignee for the bug.



More information about the SM-Grimoire-Bugs mailing list