[SM-Grimoire-Bugs] [Bug 14503] New: ifstatus doesn't compile under test grimoire with gcc/g++ 4.3.0

bugzilla-daemon at bugs.sourcemage.org bugzilla-daemon at bugs.sourcemage.org
Thu May 1 14:40:06 EDT 2008


http://bugs.sourcemage.org/show_bug.cgi?id=14503

           Summary: ifstatus doesn't compile under test grimoire with
                    gcc/g++ 4.3.0
           Product: Codex
           Version: test grimoire
          Platform: x86
        OS/Version: Linux
            Status: NEW
          Severity: normal
          Priority: P2
         Component: net
        AssignedTo: sm-grimoire-bugs at lists.ibiblio.org
        ReportedBy: jevv.cr at gmail.com


ifstatus doesn't compile any more under test after the gcc/g++ upgrade to 4.3.0:

g++ -march=pentium3 -pipe -O3   -c -o Config.o Config.cc
In file included from Config.cc:26:
Main.h:74: warning: 'typedef' was ignored in this declaration
Config.cc: In member function 'void Config::LoadHomePath()':
Config.cc:119: error: 'getenv' was not declared in this scope
Config.cc: In member function 'void Config::LoadDefaultConfig()':
Config.cc:132: error: 'getenv' was not declared in this scope
make: *** [Config.o] Error 1

The whole cast log is also attached.  Sorry I'm not contributing with any work
around, :(.

Javier.

-- 
Configure bugmail: http://bugs.sourcemage.org/userprefs.cgi?tab=email
------- You are receiving this mail because: -------
You are the assignee for the bug, or are watching the assignee.



More information about the SM-Grimoire-Bugs mailing list