[SM-Grimoire-Bugs] [Bug 14424] New: mac80211 needs rsync and fails cast for other reasons

bugzilla-daemon at bugs.sourcemage.org bugzilla-daemon at bugs.sourcemage.org
Tue Apr 1 00:42:44 EDT 2008


http://bugs.sourcemage.org/show_bug.cgi?id=14424

           Summary: mac80211 needs rsync and fails cast for other reasons
           Product: Codex
           Version: test grimoire
          Platform: x86
        OS/Version: Linux
            Status: NEW
          Severity: normal
          Priority: P2
         Component: kernels
        AssignedTo: sm-grimoire-bugs at lists.ibiblio.org
        ReportedBy: briareus at gmail.com


I don't have the initial log of the first try, but mac80211 failed for lack of
rsync immediately.  rsync does not appear in mac80211 dependencies.  Casting
rsync allowed the cast to go further, but failed further in during what appears
to be an attempt to build wext drivers (or something like that)...

<snip>
In file included from net/mac80211/ieee80211.c:30:
net/mac80211/ieee80211_i.h:39:1: warning: "BIT" redefined
In file included from include/linux/kernel.h:15,
                 from include/net/mac80211.h:14,
                 from net/mac80211/ieee80211.c:11:
include/linux/bitops.h:6:1: warning: this is the location of the previous definition
net/mac80211/ieee80211.c: In function 'ieee80211_tx_prepare':
net/mac80211/ieee80211.c:1376: warning: passing argument 1 of 'dev_get_by_index'
makes pointer from integer without a cast
net/mac80211/ieee80211.c:1376: error: too few arguments to function
'dev_get_by_index'
net/mac80211/ieee80211.c: In function 'ieee80211_master_start_xmit':
net/mac80211/ieee80211.c:1657: warning: passing argument 1 of 'dev_get_by_index'
makes pointer from integer without a cast
net/mac80211/ieee80211.c:1657: error: too few arguments to function
'dev_get_by_index'
net/mac80211/ieee80211.c: In function 'ieee80211_beacon_get':
net/mac80211/ieee80211.c:2089: warning: passing argument 1 of 'dev_get_by_index'
makes pointer from integer without a cast
net/mac80211/ieee80211.c:2089: error: too few arguments to function
'dev_get_by_index'
net/mac80211/ieee80211.c: In function 'ieee80211_get_buffered_bc':
net/mac80211/ieee80211.c:2256: warning: passing argument 1 of 'dev_get_by_index'
makes pointer from integer without a cast
net/mac80211/ieee80211.c:2256: error: too few arguments to function
'dev_get_by_index'
net/mac80211/ieee80211.c: In function 'ieee80211_if_mgmt_setup':
net/mac80211/ieee80211.c:5185: error: 'struct net_device' has no member named
'hard_header_parse'
net/mac80211/ieee80211.c: In function 'ieee80211_alloc_hw':
net/mac80211/ieee80211.c:5325: error: 'struct net_device' has no member named
'hard_header_parse'
make[2]: *** [net/mac80211/ieee80211.o] Error 1
make[1]: *** [net/mac80211] Error 2
make[1]: *** Waiting for unfinished jobs....
  CC [M]  net/ieee80211/ieee80211_wx.o
  CC [M]  net/ieee80211/ieee80211_geo.o
  CC [M]  net/ieee80211/ieee80211_crypt.o
  CC [M]  net/ieee80211/ieee80211_crypt_wep.o
  CC [M]  net/ieee80211/ieee80211_crypt_ccmp.o
  CC [M]  net/ieee80211/ieee80211_crypt_tkip.o
  CC [M]  net/ieee80211/softmac/ieee80211softmac_io.o
  LD [M]  net/ieee80211/ieee80211.o
  CC [M]  net/ieee80211/softmac/ieee80211softmac_auth.o
  CC [M]  net/ieee80211/softmac/ieee80211softmac_module.o
  CC [M]  net/ieee80211/softmac/ieee80211softmac_scan.o
  CC [M]  net/ieee80211/softmac/ieee80211softmac_wx.o
  CC [M]  net/ieee80211/softmac/ieee80211softmac_assoc.o
  CC [M]  net/ieee80211/softmac/ieee80211softmac_event.o
  LD [M]  net/ieee80211/softmac/ieee80211softmac.o
make: *** [net] Error 2
Running make with 2 jobs failed. Attempt to run with a single job? [y] y
  CHK     include/linux/version.h
  CHK     include/linux/utsrelease.h
  CALL    scripts/checksyscalls.sh
  CC [M]  drivers/net/wireless/iwlwifi/iwl3945-base.o
In file included from drivers/net/wireless/iwlwifi/iwl3945-base.c:49:
drivers/net/wireless/iwlwifi/iwl-3945.h:421: error: field 'alg' has incomplete type
drivers/net/wireless/iwlwifi/iwl3945-base.c: In function 'iwl3945_bg_beacon_update':
drivers/net/wireless/iwlwifi/iwl3945-base.c:3573: warning: passing argument 2 of
'ieee80211_beacon_get' makes integer from pointer without a cast
drivers/net/wireless/iwlwifi/iwl3945-base.c: In function
'iwl3945_mac_add_interface':
drivers/net/wireless/iwlwifi/iwl3945-base.c:7047: error: 'struct
ieee80211_if_init_conf' has no member named 'vif'
drivers/net/wireless/iwlwifi/iwl3945-base.c: In function
'iwl3945_mac_remove_interface':
drivers/net/wireless/iwlwifi/iwl3945-base.c:7357: error: 'struct
ieee80211_if_init_conf' has no member named 'vif'
drivers/net/wireless/iwlwifi/iwl3945-base.c: At top level:
drivers/net/wireless/iwlwifi/iwl3945-base.c:7427: warning: 'enum set_key_cmd'
declared inside parameter list
drivers/net/wireless/iwlwifi/iwl3945-base.c:7427: warning: its scope is only
this definition or declaration, which is probably not what you want
drivers/net/wireless/iwlwifi/iwl3945-base.c:7425: error: parameter 2 ('cmd') has
incomplete type
drivers/net/wireless/iwlwifi/iwl3945-base.c: In function 'iwl3945_mac_set_key':
drivers/net/wireless/iwlwifi/iwl3945-base.c:7465: error:
'IEEE80211_KEY_FLAG_GENERATE_IV' undeclared (first use in this function)
drivers/net/wireless/iwlwifi/iwl3945-base.c:7465: error: (Each undeclared
identifier is reported only once
drivers/net/wireless/iwlwifi/iwl3945-base.c:7465: error: for each function it
appears in.)
drivers/net/wireless/iwlwifi/iwl3945-base.c: At top level:
drivers/net/wireless/iwlwifi/iwl3945-base.c:8427: error: unknown field 'start'
specified in initializer
drivers/net/wireless/iwlwifi/iwl3945-base.c:8428: warning: initialization from
incompatible pointer type
drivers/net/wireless/iwlwifi/iwl3945-base.c:8432: warning: initialization from
incompatible pointer type
drivers/net/wireless/iwlwifi/iwl3945-base.c:8433: error: unknown field
'configure_filter' specified in initializer
drivers/net/wireless/iwlwifi/iwl3945-base.c:8433: warning: initialization from
incompatible pointer type
drivers/net/wireless/iwlwifi/iwl3945-base.c:8434: warning: initialization from
incompatible pointer type
drivers/net/wireless/iwlwifi/iwl3945-base.c: In function 'iwl3945_pci_probe':
drivers/net/wireless/iwlwifi/iwl3945-base.c:8478: error: 'struct ieee80211_hw'
has no member named 'rate_control_algorithm'
make[4]: *** [drivers/net/wireless/iwlwifi/iwl3945-base.o] Error 1
make[3]: *** [drivers/net/wireless/iwlwifi] Error 2
make[2]: *** [drivers/net/wireless] Error 2
make[1]: *** [drivers/net] Error 2
make: *** [drivers] Error 2
 ! Problem Detected ! 
Creating compile log /var/log/sorcery/compile/mac80211-10.0.3.bz2 
View Compile log for mac80211-10.0.3? [n] 

Spells that have been dropped:
------------------------------
iwlwifi


Spells that encountered problems:
---------------------------------
mac80211
<snip>

-- 
Configure bugmail: http://bugs.sourcemage.org/userprefs.cgi?tab=email
------- You are receiving this mail because: -------
You are the assignee for the bug, or are watching the assignee.



More information about the SM-Grimoire-Bugs mailing list