[SM-Grimoire-Bugs] [Bug 12614] kdebindings 3.4.2 fails - can't find python/Makefile.am

bugzilla-daemon at bugs.sourcemage.org bugzilla-daemon at bugs.sourcemage.org
Thu Feb 1 00:53:27 EST 2007


http://bugs.sourcemage.org/show_bug.cgi?id=12614


sourcemage at feline-soul.com changed:

           What    |Removed                     |Added
----------------------------------------------------------------------------
                 CC|                            |sourcemage at feline-soul.com




------- Additional Comments From sourcemage at feline-soul.com  2007-01-31 23:53 -------
it fails for me too, but my error is different:
marshaller.cpp: In member function 'bool 
PythonDCOP::Marshaller::marshalDict(const PythonDCOP::PCOPType&, const 
PythonDCOP::PCOPType&, PyObject*, QDataStream*) const':
marshaller.cpp:129: error: cannot convert 'int*' to 'Py_ssize_t*' for 
argument '2' to 'int PyDict_Next(PyObject*, Py_ssize_t*, PyObject**, 
PyObject**)'
marshaller.cpp:138: error: cannot convert 'int*' to 'Py_ssize_t*' for 
argument '2' to 'int PyDict_Next(PyObject*, Py_ssize_t*, PyObject**, 
PyObject**)'
make[4]: *** [marshaller.lo] Error 1


-- 
Configure bugmail: http://bugs.sourcemage.org/userprefs.cgi?tab=email
------- You are receiving this mail because: -------
You are the assignee for the bug, or are watching the assignee.



More information about the SM-Grimoire-Bugs mailing list