[SM-Grimoire-Bugs] [Bug 12642] New: ode fails to compile

bugzilla-daemon at bugs.sourcemage.org bugzilla-daemon at bugs.sourcemage.org
Fri Jun 9 08:45:46 EDT 2006


           Summary: ode fails to compile
           Product: Codex
           Version: test grimoire
          Platform: Other
        OS/Version: other
            Status: NEW
          Severity: normal
          Priority: P2
         Component: libs
        AssignedTo: sm-grimoire-bugs at lists.ibiblio.org
        ReportedBy: siflfran at hawo.stw.uni-erlangen.de

g++  -g  -z combreloc -s -o dstest -L../../drawstuff/src dstest-dstest.o
-ldrawstuff -z combreloc -s  -lGL  -lstdc++ -lm -lpthread  -lstdc++ -lm -lpthread
make[2]: Leaving directory `/usr/src/ode-0.6-rc3/drawstuff/dstest'
make[1]: Leaving directory `/usr/src/ode-0.6-rc3/drawstuff'
../../drawstuff/src/libdrawstuff.a(libdrawstuff_a-drawstuff.o): In function
/usr/src/ode-0.6-rc3/drawstuff/src/drawstuff.cpp:256: undefined reference to
/usr/src/ode-0.6-rc3/drawstuff/src/drawstuff.cpp:256: undefined reference to
collect2: ld returned 1 exit status
make[2]: *** [dstest] Error 1
make[1]: *** [all-recursive] Error 1
make: *** [all-recursive] Error 1
 ! Problem Detected !

Configure bugmail: http://bugs.sourcemage.org/userprefs.cgi?tab=email
------- You are receiving this mail because: -------
You are the assignee for the bug, or are watching the assignee.

More information about the SM-Grimoire-Bugs mailing list