[SM-Grimoire-Bugs] [Bug 10051] wvstreams 4.0.1 compile error

bugzilla-daemon at bugs.sourcemage.org bugzilla-daemon at bugs.sourcemage.org
Tue Feb 14 15:21:27 EST 2006


http://bugs.sourcemage.org/show_bug.cgi?id=10051





------- Additional Comments From e-type at sourcemage.org  2006-02-14 14:21 -------
from stable-rc, no pam installed:

linking libwvbase.so...
linking libwvbase.a...
ar: creating libwvbase.a
linking libwvutils.so...
ar: creating libwvutils.a
linking libwvutils.a...
compiling streams/wvpam.o...
streams/wvpam.cc: In member function `bool WvPam::authenticate(const
WvFastString&, const WvFastString&, const WvFastString&)':
streams/wvpam.cc:71: error: `fail' undeclared (first use this function)
streams/wvpam.cc:71: error: (Each undeclared identifier is reported only once
for each function it appears in.)
make: *** [streams/wvpam.o] Error 1

-- 
Configure bugmail: http://bugs.sourcemage.org/userprefs.cgi?tab=email
------- You are receiving this mail because: -------
You are the assignee for the bug, or are watching the assignee.



More information about the SM-Grimoire-Bugs mailing list