[SM-Grimoire-Bugs] [Bug 10051] New: wvstreams 4.0.1 compile error

bugzilla-daemon at bugs.sourcemage.org bugzilla-daemon at bugs.sourcemage.org
Tue Nov 1 05:10:02 EST 2005


http://bugs.sourcemage.org/show_bug.cgi?id=10051

           Summary: wvstreams 4.0.1 compile error
           Product: Codex
           Version: stable-rc
          Platform: Other
        OS/Version: other
            Status: NEW
          Severity: normal
          Priority: P2
         Component: net
        AssignedTo: sm-grimoire-bugs at lists.ibiblio.org
        ReportedBy: e-type at cwazy.co.uk
                CC: editors at sourcemage.org


from stable-rc:


Running make with 2 jobs failed. Attempt to run with a single job? [y] 
linking libwvbase.so...
linking libwvbase.a...
ar: creating libwvbase.a
linking libwvutils.so...
linking libwvutils.a...
ar: creating libwvutils.a
compiling streams/wvpam.o...
streams/wvpam.cc: In member function `bool WvPam::authenticate(const WvFastStrin
g&, const WvFastString&, const WvFastString&)':
streams/wvpam.cc:71: error: `fail' undeclared (first use this function)
streams/wvpam.cc:71: error: (Each undeclared identifier is reported only once fo
r each function it appears in.)
make: *** [streams/wvpam.o] Error 1

-- 
Configure bugmail: http://bugs.sourcemage.org/userprefs.cgi?tab=email
------- You are receiving this mail because: -------
You are the assignee for the bug, or are watching the assignee.



More information about the SM-Grimoire-Bugs mailing list