[SM-Grimoire-Bugs] [Bug 9563] New: nvidia_driver 1.0-7667-pgk2 fails in kernel 2.6.12

bugzilla-daemon at bugs.sourcemage.org bugzilla-daemon at bugs.sourcemage.org
Sun Aug 21 17:55:59 EDT 2005


http://bugs.sourcemage.org/show_bug.cgi?id=9563

           Summary: nvidia_driver 1.0-7667-pgk2 fails in kernel 2.6.12
           Product: Codex
           Version: z-rejected grimoire
          Platform: Other
        OS/Version: other
            Status: NEW
          Severity: normal
          Priority: P2
         Component: z-rejected grimoire
        AssignedTo: z-rejected at sourcemage.org
        ReportedBy: display at sourcemage.org


Compile log for nvidia_driver 1.0-7667-pkg2 Built on Sun Aug 21 21:37:44 UTC 2005
Using gcc version: 3.4.4
Using gcc version: 3.4.4
Installing in dir: /usr/src/NVIDIA-Linux-x86-1.0-7667-pkg2
nvidia_driver    1.0-7667-pkg2

NVIDIA: calling KBUILD...
make CC=cc KBUILD_OUTPUT=/lib/modules/2.6.12/build KBUILD_VERBOSE=1 -C
/lib/modules/2.6.12/source
SUBDIRS=/usr/src/NVIDIA-Linux-x86-1.0-7667-pkg2/usr/src/nv modules
make -C /lib/modules/2.6.12/build               \
KBUILD_SRC=/usr/src/linux-2.6.12             KBUILD_VERBOSE=1   \
KBUILD_CHECK= KBUILD_EXTMOD="/usr/src/NVIDIA-Linux-x86-1.0-7667-pkg2/usr/src/nv\
       -f /usr/src/linux-2.6.12/Makefile modules
mkdir -p /usr/src/NVIDIA-Linux-x86-1.0-7667-pkg2/usr/src/nv/.tmp_versions
make -f /usr/src/linux-2.6.12/scripts/Makefile.build
obj=/usr/src/NVIDIA-Linux-x86-1.0-7667-pkg2/usr/src/nv
echo \#define NV_COMPILER \"`cc -v 2>&1 | tail -n 1`\" >
/usr/src/NVIDIA-Linux-x86-1.0-7667-pkg2/usr/src/nv/nv_compiler.h
  cc -Wp,-MD,/usr/src/NVIDIA-Linux-x86-1.0-7667-pkg2/usr/src/nv/.nv.o.d 
-nostdinc -isystem /usr/lib/gcc/i686-pc-linux-gnu/3.4.4/include -D__KERNEL__
-Iinclude -Iinclude2 -I/usr/src/linux-2.6.12/include 
-I/usr/src/NVIDIA-Linux-x86-1.0-7667-pkg2/usr/src/nv -Wall -Wstrict-prototypes
-Wno-trigraphs -fno-strict-aliasing -fno-common -ffreestanding -O2
-fomit-frame-pointer -pipe -msoft-float -mpreferred-stack-boundary=2
-fno-unit-at-a-time -march=k8
-I/usr/src/linux-2.6.12/include/asm-i386/mach-default
-Iinclude/asm-i386/mach-default -Wdeclaration-after-statement 
-I/usr/src/NVIDIA-Linux-x86-1.0-7667-pkg2/usr/src/nv -Wall -Wimplicit
-Wreturn-type -Wswitch -Wformat -Wchar-subscripts -Wparentheses -Wpointer-arith
-Wno-multichar -Werror -O -fno-common -mno-red-zone -minline-all-stringops -MD
-Wsign-compare -Wno-cast-qual -Wno-error -D_LOOSE_KERNEL_NAMES -D__KERNEL__
-DMODULE -mcmodel=kernel -DNTRM -D_GNU_SOURCE -D_LOOSE_KERNEL_NAMES -D__KERNEL__
-DMODULE -DNV_MAJOR_VERSION=1 -DNV_MINOR_VERSION=0 -DNV_PATCHLEVEL=7667 -UDEBUG
-U_DEBUG -DNDEBUG -DNV_SIGNAL_STRUCT_RLIM -DNV_MULTIPLE_BRIDGE_AGPGART_PRESENT
-DNV_REMAP_PFN_RANGE_PRESENT -DNV_CHANGE_PAGE_ATTR_PRESENT
-DNV_PCI_DISABLE_DEVICE_PRESENT -DNV_PCI_GET_CLASS_PRESENT -DNV_VMAP_4_PRESENT
-DMODULE -DKBUILD_BASENAME=nv -DKBUILD_MODNAME=nvidia -c -o
/usr/src/NVIDIA-Linux-x86-1.0-7667-pkg2/usr/src/nv/nv.o
/usr/src/NVIDIA-Linux-x86-1.0-7667-pkg2/usr/src/nv/nv.c
/usr/src/NVIDIA-Linux-x86-1.0-7667-pkg2/usr/src/nv/nv.c:1: error: code model
`kernel' not supported in the 32 bit mode
NVIDIA: left KBUILD.
nvidia.ko failed to build!
 ! Problem Detected !
make[4]: *** [/usr/src/NVIDIA-Linux-x86-1.0-7667-pkg2/usr/src/nv/nv.o] Error 1
make[3]: *** [_module_/usr/src/NVIDIA-Linux-x86-1.0-7667-pkg2/usr/src/nv] Error 2
make[2]: *** [modules] Error 2
make[1]: *** [module] Error 1
make: *** [module] Error 2

-- 
Configure bugmail: http://bugs.sourcemage.org/userprefs.cgi?tab=email
------- You are receiving this mail because: -------
You reported the bug, or are watching the reporter.



More information about the SM-Grimoire-Bugs mailing list