[SM-Grimoire-Bugs] [Bug 9551] New: Minicom doesn't build with gcc 4.0.1

bugzilla-daemon at bugs.sourcemage.org bugzilla-daemon at bugs.sourcemage.org
Sat Aug 20 17:20:52 EDT 2005


http://bugs.sourcemage.org/show_bug.cgi?id=9551

           Summary: Minicom doesn't build with gcc 4.0.1
           Product: Codex
           Version: devel grimoire
          Platform: Other
        OS/Version: other
            Status: NEW
          Severity: normal
          Priority: P2
         Component: net
        AssignedTo: sm-grimoire-bugs at lists.ibiblio.org
        ReportedBy: josebernardo1 at yahoo.com


make[2]: Entering directory `/usr/src/minicom-2.1/src'
gcc -DHAVE_CONFIG_H -I. -I. -I..   -I../lib  -O -march=athlon-4 -mmmx
-mfpmath=sse -msse
+-m3dnow -pipe -DPIC -fPIC -O3 -Wall -W -c window.c
window.c:65: error: static declaration of 'BC' follows non-static declaration
/usr/include/termcap.h:59: error: previous declaration of 'BC' was here
make[2]: *** [window.o] Error 1
make[2]: Leaving directory `/usr/src/minicom-2.1/src'
make[1]: *** [all-recursive] Error 1
make[1]: Leaving directory `/usr/src/minicom-2.1'
make: *** [all-recursive-am] Error 2
 ! Problem Detected !

-- 
Configure bugmail: http://bugs.sourcemage.org/userprefs.cgi?tab=email
------- You are receiving this mail because: -------
You are the assignee for the bug, or are watching the assignee.



More information about the SM-Grimoire-Bugs mailing list