[freetds] Problem with Building

Nguyen, Joe Joe.Nguyen at coair.com
Thu May 20 20:29:22 EDT 2004


Hi, I have a problem installing this on my sparc5 64 bit running one Suse
7.3.

 

I ran "./configure" and it completed, but when I try to "make" it, I get the
following error:

 

 

..........

: .libs/libtds_objects.a

ar cru .libs/libtds_objects.a

ranlib .libs/libtds_objects.a

creating libtds_objects.la

(cd .libs && rm -f libtds_objects.la && ln -s ../libtds_objects.la
libtds_objects.la)

/bin/sh ../../libtool --mode=link gcc  -g -O2   -o libtds.la -rpath
/usr/local/lib -version-info 3:0:0  libtds_objects.la  -liconv
../replacements/libreplacements.la 

../../libtool: test: -: integer expression expected

creating reloadable object files...

creating a temporary reloadable object file: .libs/libtds.la-1.o

/usr/sparc-suse-linux/bin/ld -r -o .libs/libtds.la-1.o 

/usr/sparc-suse-linux/bin/ld: no input files

make[3]: *** [libtds.la] Error 1

make[3]: Leaving directory `/home/downloads/freetds-0.62.3/src/tds'

make[2]: *** [all-recursive] Error 1

make[2]: Leaving directory `/home/downloads/freetds-0.62.3/src/tds'

make[1]: *** [all-recursive] Error 1

make[1]: Leaving directory `/home/downloads/freetds-0.62.3/src'

make: *** [all-recursive] Error 1

 

.....

 

Please help, 

 

Joe




More information about the FreeTDS mailing list