[freetds] (no subject)

Damian Marinaccio dxmwml at rit.edu
Tue May 11 10:17:59 EDT 2004


Hello. Still trying to get this installed on Solaris. I am using the
snapshot from 5/07/04. Make is failing now. I upgraded libtool &
autoconf based on some findings in the mailing list but I am now getting
a new error. See below:


if gcc -DHAVE_CONFIG_H -I. -I. -I../../include -I../../include
-D_FREETDS_LIBRARY_SOURCE -DMSDBLIB -D_REENTRANT -D_THREAD_SAFE -DD\
  -c -o bsqldb.o `test -f 'bsqldb.c' || echo './'`bsqldb.c; \
then mv ".deps/bsqldb.Tpo" ".deps/bsqldb.Po"; \
else rm -f ".deps/bsqldb.Tpo"; exit 1; \
fi
bsqldb.c: In function `print_results':
bsqldb.c:464: warning: implicit declaration of function `asprintf'
/bin/bash ../../libtool --mode=link gcc  -g -O2   -o bsqldb  bsqldb.o
../dblib/libsybdb.la -lnsl -lsocket  
gcc -g -O2 -o .libs/bsqldb bsqldb.o  ../dblib/.libs/libsybdb.so
/usr/local/lib/libiconv.so -L/usr/lib -L/usr/openwin/lib -L/usr/locab
Undefined                       first referenced
 symbol                             in file
asprintf                            bsqldb.o
ld: fatal: Symbol referencing errors. No output written to .libs/bsqldb
collect2: ld returned 1 exit status
make[2]: *** [bsqldb] Error 1
make[2]: Leaving directory `/src/freetds-0.63.dev.20040507/src/apps'
make[1]: *** [all-recursive] Error 1
make[1]: Leaving directory `/src/freetds-0.63.dev.20040507/src'
make: *** [all-recursive] Error 1


Any Ideas??

Thanks,

Damian Marinaccio
RIT Library
dxmwml at rit.edu
585.475.7741



More information about the FreeTDS mailing list